Ontology
comment: The single-file version of the general purpose ontology 'util'. This file is useful for viewing the ontology in a program such as Protege and generating owlDocs. It should not be used directly by SSWAP. For SSWAP, use the one-term-per-file terms at the ontology URL.

Web-based User Interface
type: Class
comment: A marker class for a web page intended for human interaction.
subclass of: Web Document

Web Document
type: Class
comment: A marker class for a web document; e.g., any web page, be it static, dynamic, interactive, or informational.
subclass of: Util

Util
type: Class
comment: The root class for all general purpose utility terms.